Target
Plasma kallikrein
Ligand
BDBM303805
Substrate
Meas. Tech.
Determination of the Plasma Kallikrein Activity
IC50
3900±n/a nM
Citation
 Röhrig, SHillisch, AHeitmeier, SSchmidt, MVSchlemmer, KTersteegen, ASchäfer, MTeller, HJimènez Nùnez, E Factor xia-inhibiting pyridobenzazepine and pyridobenzazocine derivatives US Patent  US10138236 Publication Date 11/27/2018 
Target
Name:
Plasma kallikrein
Synonyms:
Fletcher factor KLKB1 Kallikrein Plasma kallikrein heavy chain Plasma prekallikrein
Type:
Protein
Mol. Mass.:
71391.16
Organism:
Homo sapiens (Human)
Description:
P03952
Residue:
638
  
Inhibitor
Name:
BDBM303805
Synonyms:
5-{[2-(11′-Chloro-2′,5′-dioxo-2′,5′,6′,8′-tetrahydro-3′H-spiro[cyclopropane-1,7′-pyrido[3,4-e][3]benzazocine]-3′-yl)-4-methoxybutanoyl]amino}thiophene-3-carboxylic acid (Stereoisomer Mixture) | US10138236, Example 23
Type:
Small organic molecule
Emp. Form.:
C26H24ClN3O6S
Mol. Mass.:
542.003
SMILES:
COCCC(C(=O)Nc1cc(cs1)C(O)=O)n1cc2c(cc1=O)-c1cc(Cl)ccc1CC1(CC1)NC2=O
: