Target
Receptor-interacting serine/threonine-protein kinase 2
Ligand
BDBM303820
Substrate
Meas. Tech.
V9103X ADP-Glo Kinase Assay
IC50
66.0±n/a nM
Citation
 Liu, PMiller, CAYu, MZhang, ZRuppel, SPadyana, AK Substituted benzamides as RIPK2 inhibitors US Patent  US10138241 Publication Date 11/27/2018 
Target
Name:
Receptor-interacting serine/threonine-protein kinase 2
Synonyms:
CARDIAK RIP2 RIPK2_HUMAN Tyrosine-protein kinase RIPK2 | receptor-interacting serine/threonine-protein kinase 2
Type:
Protein
Mol. Mass.:
61201.30
Organism:
Homo sapiens (Human)
Description:
Residue:
540
  
Inhibitor
Name:
BDBM303820
Synonyms:
US10138241, Example 3 | US11130754, Example 3
Type:
Small organic molecule
Emp. Form.:
C23H22N6O2
Mol. Mass.:
414.4598
SMILES:
CNC(=O)c1ccc2ncc(-n3cnc(c3)-c3cc(ccc3C)C(=O)NC3CC3)n2c1
: