Target
Receptor-interacting serine/threonine-protein kinase 2
Ligand
BDBM303835
Substrate
Meas. Tech.
V9103X ADP-Glo Kinase Assay
IC50
970±n/a nM
Citation
 Liu, PMiller, CAYu, MZhang, ZRuppel, SPadyana, AK Substituted benzamides as RIPK2 inhibitors US Patent  US10138241 Publication Date 11/27/2018 
Target
Name:
Receptor-interacting serine/threonine-protein kinase 2
Synonyms:
CARDIAK RIP2 RIPK2_HUMAN Tyrosine-protein kinase RIPK2 | receptor-interacting serine/threonine-protein kinase 2
Type:
Protein
Mol. Mass.:
61201.30
Organism:
Homo sapiens (Human)
Description:
Residue:
540
  
Inhibitor
Name:
BDBM303835
Synonyms:
US10138241, Example 20 | US11130754, Example 20
Type:
Small organic molecule
Emp. Form.:
C25H27N5O3S
Mol. Mass.:
477.579
SMILES:
Cc1ccc(cc1-c1cnn(c1)-c1cn2cc(ccc2n1)S(=O)(=O)C(C)(C)C)C(=O)NC1CC1
: