Target
Receptor-interacting serine/threonine-protein kinase 2
Ligand
BDBM303836
Substrate
Meas. Tech.
V9103X ADP-Glo Kinase Assay
IC50
6.70±n/a nM
Citation
 Liu, PMiller, CAYu, MZhang, ZRuppel, SPadyana, AK Substituted benzamides as RIPK2 inhibitors US Patent  US10138241 Publication Date 11/27/2018 
Target
Name:
Receptor-interacting serine/threonine-protein kinase 2
Synonyms:
CARDIAK RIP2 RIPK2_HUMAN Tyrosine-protein kinase RIPK2 | receptor-interacting serine/threonine-protein kinase 2
Type:
Protein
Mol. Mass.:
61201.30
Organism:
Homo sapiens (Human)
Description:
Residue:
540
  
Inhibitor
Name:
BDBM303836
Synonyms:
US10138241, Example 21 | US11130754, Example 21
Type:
Small organic molecule
Emp. Form.:
C21H17ClFN5O3S
Mol. Mass.:
473.908
SMILES:
CS(=O)(=O)c1ccc2ncc(-n3cc(cn3)-c3cc(C(=O)NC4CC4)c(F)cc3Cl)n2c1
: