Target
PEX5-related protein/Peroxisomal membrane protein PEX14
Ligand
BDBM303994
Substrate
Meas. Tech.
Antitrypanosomal Activity Assay
IC50
2760±n/a nM
Citation
 Sattler, MPopowicz, GDawidowski, MEmmanouilidis, LErdmann, RSchliebs, WKalel, V Pyrazolopyridine derivatives and their use in therapy US Patent  US10138242 Publication Date 11/27/2018 
Target
Name:
PEX5-related protein/Peroxisomal membrane protein PEX14
Synonyms:
PEX14-PEX5
Type:
Enzyme
Mol. Mass.:
Description:
Components:
This complex has 2 components.
Component 1
Name:
Peroxisomal membrane protein PEX14
Synonyms:
PEX14 PTS1 receptor-docking protein Peroxisomal membrane anchor protein PEX14
Type:
Enzyme Catalytic Domain
Mol. Mass.:
41218.98
Organism:
Homo sapiens (Human)
Description:
O75381
Residue:
377
  
Component 2
Name:
PEX5-related protein
Synonyms:
PEX2-related protein PEX5L PEX5R_HUMAN Peroxin-5-related protein Pex5Rp Tetratricopeptide repeat-containing Rab8b-interacting protein
Type:
Enzyme Catalytic Domain
Mol. Mass.:
69680.62
Organism:
Homo sapiens (Human)
Description:
Q8IYB4
Residue:
626
  
Inhibitor
Name:
BDBM303994
Synonyms:
US10138242, Compound 80
Type:
Small organic molecule
Emp. Form.:
C30H32N4O2
Mol. Mass.:
480.6007
SMILES:
Cc1ccccc1-c1ccc(CN2CCc3c(C2)c(nn3CCO)C(=O)NCc2ccccc2)cc1
: