Target
PEX5-related protein/Peroxisomal membrane protein PEX14
Ligand
BDBM304019
Substrate
Meas. Tech.
AlphaScreen Assay
EC50
38700±n/a nM
Citation
 Sattler, MPopowicz, GDawidowski, MEmmanouilidis, LErdmann, RSchliebs, WKalel, V Pyrazolopyridine derivatives and their use in therapy US Patent  US10138242 Publication Date 11/27/2018 
Target
Name:
PEX5-related protein/Peroxisomal membrane protein PEX14
Synonyms:
PEX14-PEX5
Type:
Enzyme
Mol. Mass.:
Description:
Components:
This complex has 2 components.
Component 1
Name:
Peroxisomal membrane protein PEX14
Synonyms:
PEX14 PTS1 receptor-docking protein Peroxisomal membrane anchor protein PEX14
Type:
Enzyme Catalytic Domain
Mol. Mass.:
41218.98
Organism:
Homo sapiens (Human)
Description:
O75381
Residue:
377
  
Component 2
Name:
PEX5-related protein
Synonyms:
PEX2-related protein PEX5L PEX5R_HUMAN Peroxin-5-related protein Pex5Rp Tetratricopeptide repeat-containing Rab8b-interacting protein
Type:
Enzyme Catalytic Domain
Mol. Mass.:
69680.62
Organism:
Homo sapiens (Human)
Description:
Q8IYB4
Residue:
626
  
Inhibitor
Name:
BDBM304019
Synonyms:
US10138242, Compound 108
Type:
Small organic molecule
Emp. Form.:
C31H31N5O4
Mol. Mass.:
537.6089
SMILES:
COC(=O)c1ccc2c(CN3CCc4c(C3)c(nn4CCO)C(=O)NCc3cccc4ccccc34)c[nH]c2c1
: