Target
cAMP and cAMP-inhibited cGMP 3',5'-cyclic phosphodiesterase 10A
Ligand
BDBM304043
Substrate
Meas. Tech.
Assay of Phosphodiesterase 10 Inhibition In Vitro
IC50
35.7±n/a nM
Citation
 Moszczynski-Petkowski, RBojarski, LWieczorek, MMajer, JJanowska, SMatloka, MBorkowska, MStefaniak, FLamparska-Przybysz, MDubiel, K Fused triazole derivatives as phosphodiesterase 10A inhibitors US Patent  US10138245 Publication Date 11/27/2018 
Target
Name:
cAMP and cAMP-inhibited cGMP 3',5'-cyclic phosphodiesterase 10A
Synonyms:
3',5'-cyclic phosphodiesterase PDE10_HUMAN Phosphodiesterase 10A
Type:
Protein
Mol. Mass.:
88412.52
Organism:
Homo sapiens (Human)
Description:
Q9Y233
Residue:
779
  
Inhibitor
Name:
BDBM304043
Synonyms:
5,8-Dimethyl-2-(2-phenylimidazo[1,2-a]pyrimidin-7-yl)[1,2,4]triazolo[1,5-a]pyrazine | US10138245, Example 57
Type:
Small organic molecule
Emp. Form.:
C20H16N6
Mol. Mass.:
340.3812
SMILES:
Cc1cnc(C)c2nc(nn12)-c1cccc2nc([nH]c12)-c1ccccc1
: