Target
Lysine-specific histone demethylase 1A
Ligand
BDBM304044
Substrate
Meas. Tech.
LSD1 Histone Demethylase Biochemical Assay
IC50
<50±n/a nM
Citation
 Wu, LWang, XYao, WZhang, C Triazolopyridines and triazolopyrazines as LSD1 inhibitors US Patent  US10138249 Publication Date 11/27/2018 
Target
Name:
Lysine-specific histone demethylase 1A
Synonyms:
AOF2 Flavin-containing amine oxidase domain-containing protein 2 KDM1A KIAA0601 Lysine-specific demethylase 1 (LSD1) Lysine-specific histone demethylase 1 (LSD1)
Type:
Enzyme
Mol. Mass.:
92901.01
Organism:
Homo sapiens (Human)
Description:
O60341
Residue:
852
  
Inhibitor
Name:
BDBM304044
Synonyms:
4-{5-(4-methylphenyl)-8-[(3R)-pyrrolidin-3-ylmethoxy][1,2,4]triazolo[4,3-a]pyridin-6-yl}benzonitrile US9758523, Example 1
Type:
Small organic molecule
Emp. Form.:
C25H23N5O
Mol. Mass.:
409.483
SMILES:
Cc1ccc(cc1)-c1c(cc(OC[C@@H]2CCNC2)c2nncn12)-c1ccc(cc1)C#N
: