Target
TGF-beta receptor type-1
Ligand
BDBM50015822
Substrate
Meas. Tech.
Cell-Free Assay for Evaluating Inhibition of ALK5 Kinase Phosphorylatio
IC50
78.0±n/a nM
Citation
 Kim, DSheen, YYJin, CPark, CDomalapally, SKota, SRMaddeboina, KVura Bala, S Methods of treating fibrosis, cancer and vascular injuries US Patent  USRE47141 Publication Date 11/27/2018 
Target
Name:
TGF-beta receptor type-1
Synonyms:
ALK-5 Activin A receptor type II-like protein kinase of 53kD SKR4 TGF-beta receptor type I TGFBR1 TGFR1_HUMAN Transforming growth factor-beta receptor type I
Type:
enzyme
Mol. Mass.:
55968.24
Organism:
Homo sapiens (Human)
Description:
P36897
Residue:
503
  
Inhibitor
Name:
BDBM50015822
Synonyms:
CHEMBL3260611 | USRE47141, Example 73
Type:
Small organic molecule
Emp. Form.:
C24H21N7O2
Mol. Mass.:
439.4692
SMILES:
COC(=O)c1ccc(NCc2nc(c([nH]2)-c2cccc(C)n2)-c2ccc3ncnn3c2)cc1
: