Target
TGF-beta receptor type-1
Ligand
BDBM304168
Substrate
Meas. Tech.
Cell-Free Assay for Evaluating Inhibition of ALK5 Kinase Phosphorylatio
IC50
22.5±n/a nM
Citation
 Kim, DSheen, YYJin, CPark, CDomalapally, SKota, SRMaddeboina, KVura Bala, S Methods of treating fibrosis, cancer and vascular injuries US Patent  USRE47141 Publication Date 11/27/2018 
Target
Name:
TGF-beta receptor type-1
Synonyms:
ALK-5 Activin A receptor type II-like protein kinase of 53kD SKR4 TGF-beta receptor type I TGFBR1 TGFR1_HUMAN Transforming growth factor-beta receptor type I
Type:
enzyme
Mol. Mass.:
55968.24
Organism:
Homo sapiens (Human)
Description:
P36897
Residue:
503
  
Inhibitor
Name:
BDBM304168
Synonyms:
USRE47141, Example 151
Type:
Small organic molecule
Emp. Form.:
C23H19N7O2
Mol. Mass.:
425.4427
SMILES:
Cc1cccc(n1)-c1[nH]c(COc2cccc(c2)C(N)=O)nc1-c1ccc2ncnn2c1
: