Target
Coagulation factor XI
Ligand
BDBM304126
Substrate
Meas. Tech.
Factor XIa Assay
IC50
0.140±n/a nM
Citation
 Shen, DKuang, RKumar, PDuffy, JLZhu, CAli, AYang, MDebenham, JS Factor XIa inhibitors US Patent  US10143681 Publication Date 12/4/2018 
Target
Name:
Coagulation factor XI
Synonyms:
Coagulation factor XIa Coagulation factor XIa light chain FA11_HUMAN Factor XIa PTA | Plasma thromboplastin antecedent
Type:
Enzyme
Mol. Mass.:
70130.58
Organism:
Homo sapiens (Human)
Description:
P03951
Residue:
625
  
Inhibitor
Name:
BDBM304126
Synonyms:
(R)-trans-4-{[2-{5-[3-chloro-6-(difluoromethoxy)-2-fluorophenyl]-1-oxidopyridin-2-yl}-3-(4-hydroxycyclohexyl)propanoyl]amino}benzoic Acid | US10143681, Example 35
Type:
Small organic molecule
Emp. Form.:
C28H26ClF3N2O6
Mol. Mass.:
578.964
SMILES:
O[C@H]1CC[C@H](C[C@@H](C(=O)Nc2ccc(cc2)C(O)=O)c2ccc(c[n+]2[O-])-c2c(F)c(Cl)ccc2OC(F)F)CC1
: