Target
Plasma kallikrein
Ligand
BDBM304133
Substrate
Meas. Tech.
Kallikrein Assay
IC50
25.0±n/a nM
Citation
 Shen, DKuang, RKumar, PDuffy, JLZhu, CAli, AYang, MDebenham, JS Factor XIa inhibitors US Patent  US10143681 Publication Date 12/4/2018 
Target
Name:
Plasma kallikrein
Synonyms:
Fletcher factor KLKB1 Kallikrein Plasma kallikrein heavy chain Plasma prekallikrein
Type:
Protein
Mol. Mass.:
71391.16
Organism:
Homo sapiens (Human)
Description:
P03952
Residue:
638
  
Inhibitor
Name:
BDBM304133
Synonyms:
(R)-4-{[2-{5-[3-chloro-6-(difluoromethoxy)-2-fluorophenyl]-1-oxidopyridin-2-yl}-3-(4,4-difluorocyclohexyl)propanoyl]amino}benzoic Acid | US10143681, Example 39
Type:
Small organic molecule
Emp. Form.:
C28H24ClF5N2O5
Mol. Mass.:
598.946
SMILES:
OC(=O)c1ccc(NC(=O)[C@H](CC2CCC(F)(F)CC2)c2ccc(c[n+]2[O-])-c2c(F)c(Cl)ccc2OC(F)F)cc1
: