Target
Plasma kallikrein
Ligand
BDBM304195
Substrate
Meas. Tech.
Kallikrein Assay
IC50
2.70±n/a nM
Citation
 Shen, DKuang, RKumar, PDuffy, JLZhu, CAli, AYang, MDebenham, JS Factor XIa inhibitors US Patent  US10143681 Publication Date 12/4/2018 
Target
Name:
Plasma kallikrein
Synonyms:
Fletcher factor KLKB1 Kallikrein Plasma kallikrein heavy chain Plasma prekallikrein
Type:
Protein
Mol. Mass.:
71391.16
Organism:
Homo sapiens (Human)
Description:
P03952
Residue:
638
  
Inhibitor
Name:
BDBM304195
Synonyms:
2-(1-((4- carboxyphenyl)amino)-1- oxo-3-(2- (trifluoromethyl)cyclopropyl) propan-2-yl)-5-(3-chloro- 6-(difluoromethyl)-2- fluorophenyl)pyridine 1- oxide BDBM304197 | US10143681, Example 86
Type:
Small organic molecule
Emp. Form.:
C26H19ClF6N2O4
Mol. Mass.:
572.883
SMILES:
OC(=O)c1ccc(NC(=O)C(CC2CC2C(F)(F)F)c2ccc(c[n+]2[O-])-c2c(F)c(Cl)ccc2C(F)F)cc1
: