Target
Isoform 1 of Metabotropic glutamate receptor 5 (5a)
Ligand
BDBM174239
Substrate
Meas. Tech.
mGluR5 FLIPR Assay
EC50
30±n/a nM
Citation
 Degnan, APMaxwell, DHill, MDFang, HParker, MFYang, FBronson, JJMacor, JE Oxazolidinones as modulators of mGluR5 US Patent  US9688669 Publication Date 6/27/2017 
Target
Name:
Isoform 1 of Metabotropic glutamate receptor 5 (5a)
Synonyms:
GPRC1E GRM5_HUMAN Metabotropic glutamate receptor 5 Metabotropic glutamate receptor 5 (mGlu5a) Metabotropic glutamate receptor 5a (mGluR5) Metabotropic glutamate receptor subtype 5 (mGluR5)
Type:
Enzyme
Mol. Mass.:
128885.13
Organism:
Homo sapiens (Human)
Description:
P41594-2
Residue:
1180
  
Inhibitor
Name:
BDBM174239
Synonyms:
US9688669, Example 70
Type:
Small organic molecule
Emp. Form.:
C20H16F3N3O2
Mol. Mass.:
387.3551
SMILES:
Fc1cccc(c1)[C@H]1OC(=O)N[C@@H]1c1cncc(c1)C#CCN1CC(F)(F)C1
: