Target
Receptor tyrosine-protein kinase erbB-2
Ligand
BDBM304235
Substrate
Meas. Tech.
MCF7 Cell Viability Assay for Antibody-Polymer-Drug Conjugates
IC50
13.9±n/a nM
Citation
 Yin, MThomas, JDYurkovetskiy, AVConlon, PRDu, BKelleher, EWLowinger, TBTang, S Pyrrolobenzodiazepines and conjugates thereof US Patent  US10143695 Publication Date 12/4/2018 
Target
Name:
Receptor tyrosine-protein kinase erbB-2
Synonyms:
2.7.10.1 CD_antigen=CD340 ERBB2_HUMAN FASN/HER2 HER2 MLN19 NEU Proto-oncogene Neu Tyrosine kinase-type cell surface receptor HER2 | p185erbB2
Type:
Mol. Mass.:
137894.47
Organism:
Homo sapiens (Human)
Description:
P04626
Residue:
1255
  
Inhibitor
Name:
BDBM304235
Synonyms:
US10143695, Compound 12
Type:
Small organic molecule
Emp. Form.:
C37H37N9O6
Mol. Mass.:
703.7464
SMILES:
COc1cc2c(cc1OCCCC(=O)Nc1cn(C)c(n1)C(=O)Nc1cc(C(=O)n3ccc4cc(N)ccc34)n(C)c1)N=C[C@@H]1CC(=C)CN1C2=O
: