Target
Oxysterols receptor LXR-alpha
Ligand
BDBM50177012
Substrate
Meas. Tech.
Human LXRalpha and LXRbeta Coactivator Recruitment FRET Assay
EC50
107±n/a nM
Citation
 Claremon, DADong, CFan, YLeftheris, KLotesta, SDSingh, SBTice, CMZhao, WZheng, YZhuang, L Piperazine derivatives as liver X receptor modulators US Patent  US10144715 Publication Date 12/4/2018 
Target
Name:
Oxysterols receptor LXR-alpha
Synonyms:
LXRA Liver X receptor alpha Liver X receptor alpha (NR1H3) NR1H3 Nuclear orphan receptor LXR-alpha | Nuclear receptor subfamily 1 group H member 3
Type:
Enzyme Catalytic Domain
Mol. Mass.:
50403.85
Organism:
Homo sapiens (Human)
Description:
Q13133
Residue:
447
  
Inhibitor
Name:
BDBM50177012
Synonyms:
CHEMBL3814153 | US10144715, Compound 7-32
Type:
Small organic molecule
Emp. Form.:
C19H22F4N4O2S
Mol. Mass.:
446.462
SMILES:
CC(C)[C@@H]1CN(CCN1c1nccc(n1)C(F)(F)F)c1ccc(F)c(c1)S(C)(=O)=O
: