Target
Oxysterols receptor LXR-alpha
Ligand
BDBM304502
Substrate
Meas. Tech.
LXR alpha/beta Radioligand Binding Assay
Ki
41.0±n/a nM
Citation
 Claremon, DADong, CFan, YLeftheris, KLotesta, SDSingh, SBTice, CMZhao, WZheng, YZhuang, L Piperazine derivatives as liver X receptor modulators US Patent  US10144715 Publication Date 12/4/2018 
Target
Name:
Oxysterols receptor LXR-alpha
Synonyms:
LXRA Liver X receptor alpha Liver X receptor alpha (NR1H3) NR1H3 Nuclear orphan receptor LXR-alpha | Nuclear receptor subfamily 1 group H member 3
Type:
Enzyme Catalytic Domain
Mol. Mass.:
50403.85
Organism:
Homo sapiens (Human)
Description:
Q13133
Residue:
447
  
Inhibitor
Name:
BDBM304502
Synonyms:
(R)-(4-(3-isopropyl-4-(6-(trifluoromethyl)pyridin-3-yl)piperazin-1-yl)-2-(methylsulfonyl)phenyl)methanol | US10144715, Compound 20-4
Type:
Small organic molecule
Emp. Form.:
C21H26F3N3O3S
Mol. Mass.:
457.51
SMILES:
CC(C)[C@@H]1CN(CCN1c1ccc(nc1)C(F)(F)F)c1ccc(CO)c(c1)S(C)(=O)=O
: