Target
Glycogen synthase kinase-3 alpha
Ligand
BDBM8314
Substrate
Biotinylated Peptide Substrate
Meas. Tech.
Kinase Inhibition SPA Assay
pH
7±n/a
Temperature
295.15±n/a K
IC50
2343±135 nM
Citation
 Witherington, JBordas, VGarland, SLHickey, DMIfe, RJLiddle, JSaunders, MSmith, DGWard, RW 5-aryl-pyrazolo[3,4-b]pyridines: potent inhibitors of glycogen synthase kinase-3 (GSK-3). Bioorg Med Chem Lett 13:1577-80 (2003)  
Target
Name:
Glycogen synthase kinase-3 alpha
Synonyms:
GSK-3 alpha GSK3A_HUMAN Glycogen synthase kinase-3 Glycogen synthase kinase-3 alpha (GSK3 Alpha) Glycogen synthase kinase-3 alpha (GSK3alpha)
Type:
Enzyme
Mol. Mass.:
50991.79
Organism:
Homo sapiens (Human)
Description:
P49840
Residue:
483
  
Inhibitor
Name:
BDBM8314
Synonyms:
N-{1H-pyrazolo[3,4-b]pyridin-3-yl}butanamide | pyrazolopyridine deriv. 17
Type:
Small organic molecule
Emp. Form.:
C10H12N4O
Mol. Mass.:
204.2285
SMILES:
CCCC(=O)Nc1n[nH]c2ncccc12
:
Substrate
Name:
Biotinylated Peptide Substrate
Synonyms:
Type:
Peptide
Mol. Mass.:
3615.87
Organism:
Description:
Residue:
32