Target
Glycogen synthase kinase-3 alpha
Ligand
BDBM8384
Substrate
Biotinylated Peptide Substrate
Meas. Tech.
Kinase Inhibition SPA Assay
pH
7±n/a
Temperature
295.15±n/a K
IC50
320±61 nM
Citation
 Witherington, JBordas, VGaiba, ANaylor, ARawlings, ADSlingsby, BPSmith, DGTakle, AKWard, RW 6-heteroaryl-pyrazolo[3,4-b]pyridines: potent and selective inhibitors of glycogen synthase kinase-3 (GSK-3). Bioorg Med Chem Lett 13:3059-62 (2003)  
Target
Name:
Glycogen synthase kinase-3 alpha
Synonyms:
GSK-3 alpha GSK3A_HUMAN Glycogen synthase kinase-3 Glycogen synthase kinase-3 alpha (GSK3 Alpha) Glycogen synthase kinase-3 alpha (GSK3alpha)
Type:
Enzyme
Mol. Mass.:
50991.79
Organism:
Homo sapiens (Human)
Description:
P49840
Residue:
483
  
Inhibitor
Name:
BDBM8384
Synonyms:
CHEMBL260929 indazole analogue 26
Type:
Small organic molecule
Emp. Form.:
C15H14N4O
Mol. Mass.:
266.2979
SMILES:
O=C(Nc1n[nH]c2cc(ccc12)-c1ccc[nH]1)C1CC1
:
Substrate
Name:
Biotinylated Peptide Substrate
Synonyms:
Type:
Peptide
Mol. Mass.:
3615.87
Organism:
Description:
Residue:
32