Target
Isocitrate dehydrogenase [NADP] cytoplasmic [R132H]
Ligand
BDBM247513
Substrate
Meas. Tech.
Fluorescence Biochemical Assay
pH
7.5±n/a
Temperature
298.15±n/a K
IC50
13±n/a nM
Comments
extracted
Citation
 Caferro, TRChen, ZCho, YSCostales, AQLevell, JRLiu, GManning, JRSendzik, MShafer, CShultz, MDSutton, JCWang, YZhao, Q 3-pyrimidin-4-yl-oxazolidin-2-ones as inhibitors of mutant IDH US Patent  US9688672 Publication Date 6/27/2017 
Target
Name:
Isocitrate dehydrogenase [NADP] cytoplasmic [R132H]
Synonyms:
Cytosolic NADP-isocitrate dehydrogenase (IDH1)(R132H) IDH1 R132H IDHC_HUMAN Isocitrate dehydrogenase 1 mutant (R132H) Isocitrate dehydrogenase [NADP] cytoplasmic (IDH1)(R132H) PICD
Type:
Protein
Mol. Mass.:
46641.74
Organism:
Homo sapiens (Human)
Description:
Human IDH1 R132H (SEQ ID No. 2 in patent). First three are removed. Google patent parsed wrong.
Residue:
414
  
Inhibitor
Name:
BDBM247513
Synonyms:
US10112931, Example 51 US9688672, Example 51
Type:
Small organic molecule
Emp. Form.:
C23H22F3N5O3
Mol. Mass.:
473.4477
SMILES:
C[C@@H](O)[C@H]1COC(=O)N1c1ccnc(N[C@@H](C)c2ccc(cn2)-c2cccc(c2)C(F)(F)F)n1
: