Target
Bile acid receptor
Ligand
BDBM304718
Substrate
Meas. Tech.
Human FXR (NR1H4) Assay
EC50
5500±n/a nM
Citation
 Or, YSMa, JWang, BHe, YXing, XShen, RGranger, BHe, JLong, JWang, G Isoxazole analogs as FXR agonists and methods of use thereof US Patent  US10144729 Publication Date 12/4/2018 
Target
Name:
Bile acid receptor
Synonyms:
BAR FXR HRR1 NR1H4_HUMAN RIP14 Retinoid X receptor-interacting protein 14 | farnesoid x receptor
Type:
Nuclear Receptor
Mol. Mass.:
55916.24
Organism:
Homo sapiens (Human)
Description:
Q96RI1
Residue:
486
  
Inhibitor
Name:
BDBM304718
Synonyms:
US10144729, Example 1b
Type:
Small organic molecule
Emp. Form.:
C31H29Cl3N4O5S
Mol. Mass.:
676.01
SMILES:
CN(C)S(=O)(=O)NC(=O)Nc1ccc(cc1)[C@@H]1C[C@H]1c1ccc(OCc2c(onc2-c2c(Cl)cccc2Cl)C2CC2)cc1Cl
: