Target
Nuclear factor erythroid 2-related factor 2
Ligand
BDBM304769
Substrate
Meas. Tech.
BEAS-2B NQO1 MTT Assay
EC50
55±n/a nM
Citation
 Davies, TGWoolford, AJWillems, HMNorton, DHeightman, TDKerns, JK Nrf2 regulators US Patent  US10144731 Publication Date 12/4/2018 
Target
Name:
Nuclear factor erythroid 2-related factor 2
Synonyms:
HEBP1 NF-E2-related factor 2 NFE2-related factor 2 NRF2 Nuclear factor, erythroid derived 2, like 2
Type:
PROTEIN
Mol. Mass.:
67786.89
Organism:
Homo sapiens (Human)
Description:
ChEMBL_107924
Residue:
605
  
Inhibitor
Name:
BDBM304769
Synonyms:
3-(7-methoxy-1-methyl-1H-benzo[d][1,2,3]triazol-5-yl)-3-(3-(((R)-4-methyl-1,1-dioxido-3,4-dihydro-2H-pyrido[2,3-b][1,4,5]oxathiazepin-2-yl)methyl)phenyl)propanoic acid | US10144731, Example 61
Type:
Small organic molecule
Emp. Form.:
C26H27N5O6S
Mol. Mass.:
537.587
SMILES:
COc1cc(cc2nnn(C)c12)C(CC(O)=O)c1cccc(CN2C[C@@H](C)Oc3ncccc3S2(=O)=O)c1
: