Target
Nuclear factor erythroid 2-related factor 2
Ligand
BDBM304888
Substrate
Meas. Tech.
BEAS-2B NQO1 MTT Assay
EC50
<10±n/a nM
Citation
 Davies, TGWoolford, AJWillems, HMNorton, DHeightman, TDKerns, JK Nrf2 regulators US Patent  US10144731 Publication Date 12/4/2018 
Target
Name:
Nuclear factor erythroid 2-related factor 2
Synonyms:
HEBP1 NF-E2-related factor 2 NFE2-related factor 2 NRF2 Nuclear factor, erythroid derived 2, like 2
Type:
PROTEIN
Mol. Mass.:
67786.89
Organism:
Homo sapiens (Human)
Description:
ChEMBL_107924
Residue:
605
  
Inhibitor
Name:
BDBM304888
Synonyms:
3-(3-(((R)-4-ethyl-1,1-dioxido-3,4-dihydro-2H-benzo[b][1,4,5]oxathiazepin-2-yl)methyl)-4-methylphenyl)-5-(1-ethyl-1H-1,2,3-triazol-4-yl)-2-methylpentanoic acid | US10144731, Example 193
Type:
Small organic molecule
Emp. Form.:
C28H36N4O5S
Mol. Mass.:
540.674
SMILES:
CC[C@@H]1CN(Cc2cc(ccc2C)C(CCc2cn(CC)nn2)C(C)C(O)=O)S(=O)(=O)c2ccccc2O1
: