Target
Kelch-like ECH-associated protein 1 [321-609]
Ligand
BDBM304414
Substrate
Meas. Tech.
Nrf2-Keap1 FP Assay #1
IC50
55±n/a nM
Citation
 Davies, TGWoolford, AJWillems, HMNorton, DHeightman, TDKerns, JK Nrf2 regulators US Patent  US10144731 Publication Date 12/4/2018 
Target
Name:
Kelch-like ECH-associated protein 1 [321-609]
Synonyms:
INRF2 KEAP1_HUMAN KLHL19 | Keap1 (aa 321-609)
Type:
Enzyme Catalytic Domain
Mol. Mass.:
31620.58
Organism:
Homo sapiens (Human)
Description:
Q14145[321-609]
Residue:
289
  
Inhibitor
Name:
BDBM304414
Synonyms:
3-(7-methoxy-1-methyl-1H-benzo[d][1,2,3]triazol-5-yl)-3-(4-methyl-3-((5-methyl-1,1-dioxido-4,5-dihydrobenzo[f][1,2,5]thiadiazepin-2(3H)-yl)methyl)phenyl)propanoic acid | US10144731, Example 1
Type:
Small organic molecule
Emp. Form.:
C28H31N5O5S
Mol. Mass.:
549.641
SMILES:
COc1cc(cc2nnn(C)c12)C(CC(O)=O)c1ccc(C)c(CN2CCN(C)c3ccccc3S2(=O)=O)c1
: