Target
Kelch-like ECH-associated protein 1 [321-609]
Ligand
BDBM304751
Substrate
Meas. Tech.
Nrf2-Keap1 FP Assay #1
IC50
55±n/a nM
Citation
 Davies, TGWoolford, AJWillems, HMNorton, DHeightman, TDKerns, JK Nrf2 regulators US Patent  US10144731 Publication Date 12/4/2018 
Target
Name:
Kelch-like ECH-associated protein 1 [321-609]
Synonyms:
INRF2 KEAP1_HUMAN KLHL19 | Keap1 (aa 321-609)
Type:
Enzyme Catalytic Domain
Mol. Mass.:
31620.58
Organism:
Homo sapiens (Human)
Description:
Q14145[321-609]
Residue:
289
  
Inhibitor
Name:
BDBM304751
Synonyms:
3-(1-ethyl-4-methyl-1H-benzo[d][1,2,3]triazol-5-yl)-3-(4-methyl-3-(((R)-4-methyl-1,1-dioxido-3,4-dihydro-2H-benzo[b][1,4,5]oxathiazepin-2-yl)methyl)phenyl)propanoic acid | US10144731, Example 36
Type:
Small organic molecule
Emp. Form.:
C29H32N4O5S
Mol. Mass.:
548.653
SMILES:
CCn1nnc2c(C)c(ccc12)C(CC(O)=O)c1ccc(C)c(CN2C[C@@H](C)Oc3ccccc3S2(=O)=O)c1
: