Target
Kelch-like ECH-associated protein 1 [321-609]
Ligand
BDBM304767
Substrate
Meas. Tech.
Nrf2-Keap1 FP Assay #1
IC50
55±n/a nM
Citation
 Davies, TGWoolford, AJWillems, HMNorton, DHeightman, TDKerns, JK Nrf2 regulators US Patent  US10144731 Publication Date 12/4/2018 
Target
Name:
Kelch-like ECH-associated protein 1 [321-609]
Synonyms:
INRF2 KEAP1_HUMAN KLHL19 | Keap1 (aa 321-609)
Type:
Enzyme Catalytic Domain
Mol. Mass.:
31620.58
Organism:
Homo sapiens (Human)
Description:
Q14145[321-609]
Residue:
289
  
Inhibitor
Name:
BDBM304767
Synonyms:
(3S)-3-(1,4-dimethyl-1H-1,2,3-benzotriazol-5-yl)-3-{4-methyl-3-[(N-methylbenzenesulfonamido)methyl]phenyl}propanoic acid | US10144731, Example 56
Type:
Small organic molecule
Emp. Form.:
C26H28N4O4S
Mol. Mass.:
492.59
SMILES:
CN(Cc1cc(ccc1C)[C@H](CC(O)=O)c1ccc2n(C)nnc2c1C)S(=O)(=O)c1ccccc1
: