Target
Kelch-like ECH-associated protein 1 [321-609]
Ligand
BDBM304828
Substrate
Meas. Tech.
Nrf2-Keap1 FP Assay #1
IC50
55±n/a nM
Citation
 Davies, TGWoolford, AJWillems, HMNorton, DHeightman, TDKerns, JK Nrf2 regulators US Patent  US10144731 Publication Date 12/4/2018 
Target
Name:
Kelch-like ECH-associated protein 1 [321-609]
Synonyms:
INRF2 KEAP1_HUMAN KLHL19 | Keap1 (aa 321-609)
Type:
Enzyme Catalytic Domain
Mol. Mass.:
31620.58
Organism:
Homo sapiens (Human)
Description:
Q14145[321-609]
Residue:
289
  
Inhibitor
Name:
BDBM304828
Synonyms:
3-(7-Methoxy-1-methyl-1H-benzo[d][1,2,3]triazol-5-yl)-3-(4-methyl-3-(((R)-4-methyl-1,1-dioxido-3,4-dihydro-2H-pyrido[4,3-b][1,4,5]oxathiazepin-2-yl)methyl)phenyl)propanoic acid | US10144731, Example 128
Type:
Small organic molecule
Emp. Form.:
C27H29N5O6S
Mol. Mass.:
551.614
SMILES:
COc1cc(cc2nnn(C)c12)C(CC(O)=O)c1ccc(C)c(CN2C[C@@H](C)Oc3ccncc3S2(=O)=O)c1
: