Target
Kelch-like ECH-associated protein 1 [321-609]
Ligand
BDBM304926
Substrate
Meas. Tech.
Nrf2-Keap1 FP Assay #1
IC50
55±n/a nM
Citation
 Davies, TGWoolford, AJWillems, HMNorton, DHeightman, TDKerns, JK Nrf2 regulators US Patent  US10144731 Publication Date 12/4/2018 
Target
Name:
Kelch-like ECH-associated protein 1 [321-609]
Synonyms:
INRF2 KEAP1_HUMAN KLHL19 | Keap1 (aa 321-609)
Type:
Enzyme Catalytic Domain
Mol. Mass.:
31620.58
Organism:
Homo sapiens (Human)
Description:
Q14145[321-609]
Residue:
289
  
Inhibitor
Name:
BDBM304926
Synonyms:
3-(4-Cyano-2-methylphenyl)-3-(3-((4-ethyl-1,1-dioxido-3,4-dihydro-2H-pyrido[2,3-b][1,4,5]oxathiazepin-2-yl)methyl)-4-methylphenyl)propanoic acid | US10144731, Example 230
Type:
Small organic molecule
Emp. Form.:
C28H29N3O5S
Mol. Mass.:
519.612
SMILES:
CCC1CN(Cc2cc(ccc2C)C(CC(O)=O)c2ccc(cc2C)C#N)S(=O)(=O)c2cccnc2O1
: