Target
Tyrosine-protein kinase JAK2 [828-1132]
Ligand
BDBM400277
Substrate
IC50
30±n/a nM
Citation
 Huang, TXue, C Piperidin-4-yl azetidine derivatives as JAK1 inhibitors US Patent  US11285140 Publication Date 3/29/2022 
Target
Name:
Tyrosine-protein kinase JAK2 [828-1132]
Synonyms:
JAK2 JAK2_HUMAN | Tyrosine-protein kinase JAK2
Type:
Mol. Mass.:
35579.28
Organism:
Homo sapiens (Human)
Description:
O60674[828-1132]
Residue:
305
  
Inhibitor
Name:
BDBM400277
Synonyms:
US10695337, Example 32 US9999619, Example 33
Type:
Small organic molecule
Emp. Form.:
C27H25F3N8O2
Mol. Mass.:
550.535
SMILES:
COc1c(F)c(F)cc(C(=O)N2CCC(CC2)N2CC(CC#N)(C2)n2cc(cn2)-c2ncnc3[nH]ccc23)c1F
: