Target
Nicotinamide phosphoribosyltransferase
Ligand
BDBM306326
Substrate
Meas. Tech.
NAMPT Enzyme Assay
IC50
<100±n/a nM
Citation
 Gigstad, KMCardin, DPHirayama, THirose, MHu, YKakei, HLee, HMMotoyaji, TNii, NShi, ZVyskocil, SWatanabe, H Quinoxaline compounds and uses thereof US Patent  US10144742 Publication Date 12/4/2018 
Target
Name:
Nicotinamide phosphoribosyltransferase
Synonyms:
NAMPT NAmPRTase Nicotinamide phosphoribosyltransferase (NAMPT) PBEF1 | Pre-B-cell colony-enhancing factor 1
Type:
Enzyme
Mol. Mass.:
55524.98
Organism:
Homo sapiens (Human)
Description:
P43490
Residue:
491
  
Inhibitor
Name:
BDBM306326
Synonyms:
US10144742, Compound I-488
Type:
Small organic molecule
Emp. Form.:
C28H23F2N5O2
Mol. Mass.:
499.5113
SMILES:
COc1cc(ccc1F)-c1nc2cc(ccc2nc1-c1ccc(F)cc1)C(=O)NCCCc1ncc[nH]1
: