Target
Nicotinamide phosphoribosyltransferase
Ligand
BDBM306337
Substrate
Meas. Tech.
NAMPT Enzyme Assay
IC50
<100±n/a nM
Citation
 Gigstad, KMCardin, DPHirayama, THirose, MHu, YKakei, HLee, HMMotoyaji, TNii, NShi, ZVyskocil, SWatanabe, H Quinoxaline compounds and uses thereof US Patent  US10144742 Publication Date 12/4/2018 
Target
Name:
Nicotinamide phosphoribosyltransferase
Synonyms:
NAMPT NAmPRTase Nicotinamide phosphoribosyltransferase (NAMPT) PBEF1 | Pre-B-cell colony-enhancing factor 1
Type:
Enzyme
Mol. Mass.:
55524.98
Organism:
Homo sapiens (Human)
Description:
P43490
Residue:
491
  
Inhibitor
Name:
BDBM306337
Synonyms:
US10144742, Compound I-499
Type:
Small organic molecule
Emp. Form.:
C25H19ClFN5OS
Mol. Mass.:
491.968
SMILES:
Fc1ccc(cc1)-c1nc2ccc(cc2nc1-c1ccc(Cl)s1)C(=O)NCCCc1ncc[nH]1
: