Target
Tyrosine-protein kinase BTK
Ligand
BDBM174466
Substrate
Meas. Tech.
Enzymatic Activity Assay
Temperature
298.15±n/a K
IC50
72±n/a nM
Comments
extracted
Citation
 Owens, TD Tyrosine kinase inhibitors US Patent  US9688676 Publication Date 6/27/2017 
Target
Name:
Tyrosine-protein kinase BTK
Synonyms:
AGMX1 Agammaglobulinaemia tyrosine kinase B cell progenitor kinase BPK BTK_HUMAN Tyrosine Kinase BTK Tyrosine-protein kinase BTK (BTK)
Type:
Enzyme
Mol. Mass.:
76289.95
Organism:
Homo sapiens (Human)
Description:
Q06187
Residue:
659
  
Inhibitor
Name:
BDBM174466
Synonyms:
US9688676, 15 (S)-methyl4-(5-(2-((4-amino-2-oxo-3-(4-phenoxyphenyl)-2,3-dihydro-1H-imidazo[4,5-c]pyridin-1-yl)methyl)pyrrolidin-1-yl)-4-cyano-2-methyl-5-oxopent-3-en-2-yl)piperazine-1-carboxylate
Type:
Small organic molecule
Emp. Form.:
C36H40N8O5
Mol. Mass.:
664.7534
SMILES:
COC(=O)N1CCN(CC1)C(C)(C)\C=C(/C#N)C(=O)N1CCC[C@H]1Cn1c2ccnc(N)c2n(-c2ccc(Oc3ccccc3)cc2)c1=O
: