Target
Tyrosine-protein kinase BTK
Ligand
BDBM174599
Substrate
Meas. Tech.
Enzymatic Activity Assay
Temperature
298.15±n/a K
IC50
23±n/a nM
Comments
extracted
Citation
 Owens, TD Tyrosine kinase inhibitors US Patent  US9688676 Publication Date 6/27/2017 
Target
Name:
Tyrosine-protein kinase BTK
Synonyms:
AGMX1 Agammaglobulinaemia tyrosine kinase B cell progenitor kinase BPK BTK_HUMAN Tyrosine Kinase BTK Tyrosine-protein kinase BTK (BTK)
Type:
Enzyme
Mol. Mass.:
76289.95
Organism:
Homo sapiens (Human)
Description:
Q06187
Residue:
659
  
Inhibitor
Name:
BDBM174599
Synonyms:
US9688676, 34 (S)-2-(2-((4-amino-2-oxo-3-(4-phenoxyphenyl)-2,3-dihydro-1H-imidazo[4,5-c]pyridin-1-yl)methyl)pyrrolidine-1-carbonyl)-4-methyl-4-(4-methylpiperazin-1-yl)pent-2-enenitrile
Type:
Small organic molecule
Emp. Form.:
C35H40N8O3
Mol. Mass.:
620.7439
SMILES:
CN1CCN(CC1)C(C)(C)C=C(C#N)C(=O)N1CCC[C@H](C1)n1c2ccnc(N)c2n(-c2ccc(Oc3ccccc3)cc2)c1=O
: