Target
Tyrosine-protein kinase BTK
Ligand
BDBM174794
Substrate
Meas. Tech.
Enzymatic Activity Assay
Temperature
298.15±n/a K
IC50
3.10±n/a nM
Comments
extracted
Citation
 Owens, TD Tyrosine kinase inhibitors US Patent  US9688676 Publication Date 6/27/2017 
Target
Name:
Tyrosine-protein kinase BTK
Synonyms:
AGMX1 Agammaglobulinaemia tyrosine kinase B cell progenitor kinase BPK BTK_HUMAN Tyrosine Kinase BTK Tyrosine-protein kinase BTK (BTK)
Type:
Enzyme
Mol. Mass.:
76289.95
Organism:
Homo sapiens (Human)
Description:
Q06187
Residue:
659
  
Inhibitor
Name:
BDBM174794
Synonyms:
US9688676, 55 (R)-2-(3-(4-amino-2-oxo-3-(4-phenoxyphenyl)-2,3-dihydro-1H-imidazo[4,5-c]pyridin-1-yl)piperidine-1-carbonyl)-4-methyl-4-(pyridin-2-yl)pent-2-enenitrile
Type:
Small organic molecule
Emp. Form.:
C35H36N6O3
Mol. Mass.:
588.6987
SMILES:
C\C(=C/C(C)(C)c1ccccn1)C(=O)N1CCC[C@H](C1)n1c2ccnc(N)c2n(-c2ccc(Oc3ccccc3)cc2)c1=O
: