Target
Glycogen synthase kinase-3 beta
Ligand
BDBM8553
Substrate
GSK-3 Peptide Substrate
Meas. Tech.
Kinase Inhibition Assay
pH
7±n/a
Temperature
295.15±n/a K
IC50
198000±n/a nM
Citation
 Naerum, LNorskov-Lauritsen, LOlesen, PH Scaffold hopping and optimization towards libraries of glycogen synthase kinase-3 inhibitors. Bioorg Med Chem Lett 12:1525-8 (2002)  
Target
Name:
Glycogen synthase kinase-3 beta
Synonyms:
GSK-3 beta GSK3B Glycogen synthase kinase 3 beta (GSK3B) Glycogen synthase kinase-3 beta (GSK-3B) Glycogen synthase kinase-3 beta (GSK3B) Glycogen synthase kinase-3beta (GSK3B) | Serine/threonine-protein kinase GSK3B
Type:
Enzyme
Mol. Mass.:
46756.38
Organism:
Homo sapiens (Human)
Description:
P49841
Residue:
420
  
Inhibitor
Name:
BDBM8553
Synonyms:
2-{[(4-iodophenyl)methyl]sulfanyl}-5-(pyridin-4-yl)-1,3,4-oxadiazole | oxadiazole-pyridyl containing compound 13
Type:
Small organic molecule
Emp. Form.:
C14H10IN3OS
Mol. Mass.:
395.218
SMILES:
Ic1ccc(CSc2nnc(o2)-c2ccncc2)cc1
:
Substrate
Name:
GSK-3 Peptide Substrate
Synonyms:
GS-1 Peptide | Phospho-GS2 Substrate Peptide
Type:
Peptide
Mol. Mass.:
3045.17
Organism:
Description:
Residue:
27