Target
Glycogen synthase kinase-3 beta
Ligand
BDBM8561
Substrate
Biotinylated peptide substrate
Meas. Tech.
Kinase Inhibition SPA Assay
pH
7.2±n/a
Temperature
295.15±n/a K
IC50
132±n/a nM
Citation
 Maeda, YNakano, MSato, HMiyazaki, YSchweiker, SLSmith, JLTruesdale, AT 4-Acylamino-6-arylfuro[2,3-d]pyrimidines: potent and selective glycogen synthase kinase-3 inhibitors. Bioorg Med Chem Lett 14:3907-11 (2004)  
Target
Name:
Glycogen synthase kinase-3 beta
Synonyms:
GSK-3 beta GSK3B Glycogen synthase kinase 3 beta (GSK3B) Glycogen synthase kinase-3 beta (GSK-3B) Glycogen synthase kinase-3 beta (GSK3B) Glycogen synthase kinase-3beta (GSK3B) | Serine/threonine-protein kinase GSK3B
Type:
Enzyme
Mol. Mass.:
46756.38
Organism:
Homo sapiens (Human)
Description:
P49841
Residue:
420
  
Inhibitor
Name:
BDBM8561
Synonyms:
4-Acylamino-6-arylfuro[2,3-d]pyrimidine 6 | N-[6-(4-methoxyphenyl)furo[2,3-d]pyrimidin-4-yl]-2-methylpropanamide
Type:
Small organic molecule
Emp. Form.:
C17H17N3O3
Mol. Mass.:
311.3352
SMILES:
COc1ccc(cc1)-c1cc2c(NC(=O)C(C)C)ncnc2o1
:
Substrate
Name:
Biotinylated Peptide Substrate
Synonyms:
Type:
Peptide
Mol. Mass.:
6828.27
Organism:
Description:
Residue:
63