Target
Plasma kallikrein
Ligand
BDBM306498
Substrate
Meas. Tech.
In Vitro Plasma Kallikrein Inhibition Assay
IC50
5.01±n/a nM
Citation
 Li, ZZancanella, MYu, CSetti, LQSham, HXu, QYee, CWYu, M Bridged bicyclic kallikrein inhibitors US Patent  US10144746 Publication Date 12/4/2018 
Target
Name:
Plasma kallikrein
Synonyms:
Fletcher factor KLKB1 Kallikrein Plasma kallikrein heavy chain Plasma prekallikrein
Type:
Protein
Mol. Mass.:
71391.16
Organism:
Homo sapiens (Human)
Description:
P03952
Residue:
638
  
Inhibitor
Name:
BDBM306498
Synonyms:
(1R,8S)-N-[(6-amino-2,4- dimethylpyridin-3-yl)-methyl]-12- (2-cyano-4-methylphenyl)-15- oxatetracyclo[6.6.1.02,7.09,14] pentadeca-2,4,6,9,11,13- hexaene-4-carboxamide | US10144746, Compound 140
Type:
Small organic molecule
Emp. Form.:
C31H26N4O2
Mol. Mass.:
486.5637
SMILES:
Cc1ccc(-c2ccc3[C@@H]4O[C@@H](c5cc(ccc45)C(=O)NCc4c(C)cc(N)nc4C)c3c2)c(c1)C#N
: