Target
Bile acid receptor
Ligand
BDBM306715
Substrate
Meas. Tech.
Human FXR (NR1H4) Assay
EC50
<100±n/a nM
Citation
 Or, YSXing, XShen, RWang, BGranger, BMa, JHe, JLong, JHe, YWang, G Isoxazole derivatives as FXR agonists and methods of use thereof US Patent  US10149835 Publication Date 12/11/2018 
Target
Name:
Bile acid receptor
Synonyms:
BAR FXR HRR1 NR1H4_HUMAN RIP14 Retinoid X receptor-interacting protein 14 | farnesoid x receptor
Type:
Nuclear Receptor
Mol. Mass.:
55916.24
Organism:
Homo sapiens (Human)
Description:
Q96RI1
Residue:
486
  
Inhibitor
Name:
BDBM306715
Synonyms:
US10149835, Example 6
Type:
Small organic molecule
Emp. Form.:
C30H30Cl2FN3O5S
Mol. Mass.:
634.546
SMILES:
Fc1cc(ccc1N1C2CC[C@H]1CC(C2)OCc1c(onc1-c1c(Cl)cccc1Cl)C1CC1)C(=O)NS(=O)(=O)C1CC1
: