Target
Estrogen receptor
Ligand
BDBM306719
Substrate
Meas. Tech.
MCF-7 ER Down-Regulation Assay
IC50
0.490±n/a nM
Citation
 Scott, JSMoss, TAO Donovan, DHNissink, JWHughes, SJBarlaam, BCBroo, DAYang, BVarnes, JGWu, D Chemical compounds US Patent  US10149839 Publication Date 12/11/2018 
Target
Name:
Estrogen receptor
Synonyms:
ER ESR ESR1_HUMAN Estrogen receptor Estrogen receptor (ER-alpha) Estrogen receptor alpha (ER) Nuclear receptor subfamily 3 group A member 1
Type:
Protein
Mol. Mass.:
66230.44
Organism:
Homo sapiens (Human)
Description:
P03372
Residue:
595
  
Inhibitor
Name:
BDBM306719
Synonyms:
N-(2-(3,5-difluoro-4-((1R,3R)-2-((3-fluorooxetan-3-yl)methyl)-3-methyl-2,3,4,9-tetrahydro-1H-pyrido[3,4-b]indol-1-yl)phenoxy)ethyl)-3-fluoropropan-1-amine | US10149839, Example 5
Type:
Small organic molecule
Emp. Form.:
C27H31F4N3O2
Mol. Mass.:
505.5476
SMILES:
C[C@@H]1Cc2c([nH]c3ccccc23)[C@H](N1CC1(F)COC1)c1c(F)cc(OCCNCCCF)cc1F
: