Target
Estrogen receptor
Ligand
BDBM306739
Substrate
Meas. Tech.
MCF-7 ER Down-Regulation Assay
IC50
0.360±n/a nM
Citation
 Scott, JSMoss, TAO Donovan, DHNissink, JWHughes, SJBarlaam, BCBroo, DAYang, BVarnes, JGWu, D Chemical compounds US Patent  US10149839 Publication Date 12/11/2018 
Target
Name:
Estrogen receptor
Synonyms:
ER ESR ESR1_HUMAN Estrogen receptor Estrogen receptor (ER-alpha) Estrogen receptor alpha (ER) Nuclear receptor subfamily 3 group A member 1
Type:
Protein
Mol. Mass.:
66230.44
Organism:
Homo sapiens (Human)
Description:
P03372
Residue:
595
  
Inhibitor
Name:
BDBM306739
Synonyms:
BDBM306740 US10149839, Example 25
Type:
Small organic molecule
Emp. Form.:
C26H32F3N3O
Mol. Mass.:
459.547
SMILES:
C[C@@H]1Cc2c([nH]c3ccccc23)[C@H](N1C[C@H](F)CF)c1ccc(OCCNCCCF)cc1
: