Target
Estrogen receptor
Ligand
BDBM306749
Substrate
Meas. Tech.
ERalpha Binding Assay
IC50
1.80±n/a nM
Citation
 Scott, JSMoss, TAO Donovan, DHNissink, JWHughes, SJBarlaam, BCBroo, DAYang, BVarnes, JGWu, D Chemical compounds US Patent  US10149839 Publication Date 12/11/2018 
Target
Name:
Estrogen receptor
Synonyms:
ER ESR ESR1_HUMAN Estrogen receptor Estrogen receptor (ER-alpha) Estrogen receptor alpha (ER) Nuclear receptor subfamily 3 group A member 1
Type:
Protein
Mol. Mass.:
66230.44
Organism:
Homo sapiens (Human)
Description:
P03372
Residue:
595
  
Inhibitor
Name:
BDBM306749
Synonyms:
(5-bromo-3-methoxypyridin-2-yl)methanol | US10149839, Example 35
Type:
Small organic molecule
Emp. Form.:
C27H36F2N4O2
Mol. Mass.:
486.5971
SMILES:
COc1cc(OCCNCCCF)cnc1[C@H]1N(CC(C)(C)F)[C@H](C)Cc2c1[nH]c1ccccc21
: