Target
Estrogen receptor
Ligand
BDBM306787
Substrate
Meas. Tech.
MCF-7 ER Down-Regulation Assay
IC50
0.094±n/a nM
Citation
 Scott, JSMoss, TAO Donovan, DHNissink, JWHughes, SJBarlaam, BCBroo, DAYang, BVarnes, JGWu, D Chemical compounds US Patent  US10149839 Publication Date 12/11/2018 
Target
Name:
Estrogen receptor
Synonyms:
ER ESR ESR1_HUMAN Estrogen receptor Estrogen receptor (ER-alpha) Estrogen receptor alpha (ER) Nuclear receptor subfamily 3 group A member 1
Type:
Protein
Mol. Mass.:
66230.44
Organism:
Homo sapiens (Human)
Description:
P03372
Residue:
595
  
Inhibitor
Name:
BDBM306787
Synonyms:
3-fluoro-N-(2- (3-methoxy-4- ((1R,3R)-3- methyl-2- (2,2,2- trifluoroethyl)- 2,3,4,9- tetrahydro-1H- pyrido[3,4- b]indol-1- yl)phenoxy) ethyl)propan- 1-amine | US10149839, Example 73
Type:
Small organic molecule
Emp. Form.:
C26H31F4N3O2
Mol. Mass.:
493.5369
SMILES:
COc1cc(OCCNCCCF)ccc1[C@H]1N(CC(F)(F)F)[C@H](C)Cc2c1[nH]c1ccccc21
: