Target
Cytochrome P450 11B2, mitochondrial
Ligand
BDBM8607
Substrate
BDBM8582
Meas. Tech.
CYP11B assay
IC50
21±n/a nM
Citation
 Ulmschneider, SMuller-Vieira, UKlein, CDAntes, ILengauer, THartmann, RW Synthesis and evaluation of (pyridylmethylene)tetrahydronaphthalenes/-indanes and structurally modified derivatives: potent and selective inhibitors of aldosterone synthase. J Med Chem 48:1563-75 (2005)  
Target
Name:
Cytochrome P450 11B2, mitochondrial
Synonyms:
Aldosterone Synthase (CYP11B2) Aldosterone-synthesizing enzyme CYP11B2 Cytochrome P450 11B2 Cytochrome P450 11B2, mitochondrial P-450C18 | Steroid 18-hydroxylase
Type:
Protein
Mol. Mass.:
57582.15
Organism:
Homo sapiens (Human)
Description:
P19099
Residue:
503
  
Inhibitor
Name:
BDBM8607
Synonyms:
(3-Pyridylmethylene)indane 24a | 3-{[(1E)-4-fluoro-2,3-dihydro-1H-inden-1-ylidene]methyl}pyridine
Type:
Small organic molecule
Emp. Form.:
C15H12FN
Mol. Mass.:
225.2609
SMILES:
Fc1cccc2\C(CCc12)=C\c1cccnc1
:
Substrate
Name:
BDBM8582
Synonyms:
(1S,2R,10S,11S,14S,15S)-14-(2-hydroxyacetyl)-2,15-dimethyltetracyclo[8.7.0.0^{2,7}.0^{11,15}]heptadec-6-en-5-one 21-hydroxypregn-4-ene-3,20-dione [4-14C]-11-deoxycorticosterone | deoxycorticosterone
Type:
Small organic molecule
Emp. Form.:
C21H30O3
Mol. Mass.:
330.4611
SMILES:
[H][C@@]12CC[C@H](C(=O)CO)[C@@]1(C)CC[C@@]1([H])[C@@]2([H])CCC2=CC(=O)CC[C@]12C
: