Target
Vasopressin V1b receptor
Ligand
BDBM175057
Substrate
Meas. Tech.
Binding Assay
pH
7.4±n/a
Temperature
298.15±n/a K
Ki
<1.00±n/a nM
Comments
extracted
Citation
 Geneste, HHornberger, WJantos, KKling, AVan Gaalen, M Oxindole compounds carrying a nitrogen-bound spiro substituent and use thereof for treating vasopressin-related diseases US Patent  US9688678 Publication Date 6/27/2017 
Target
Name:
Vasopressin V1b receptor
Synonyms:
AVPR V1b AVPR1B Antidiuretic hormone receptor 1b V1bR VPR3 Vasopressin V1b receptor (V1b) Vasopressin V3 receptor
Type:
Enzyme
Mol. Mass.:
46985.01
Organism:
Homo sapiens (Human)
Description:
P47901
Residue:
424
  
Inhibitor
Name:
BDBM175057
Synonyms:
US9688678, 18A (+)-3-(2-methoxyphenyl)-1-[(5-methoxy-2-pyridyl)sulfonyl]-3-[2-(1-methyl-4-piperidyl)-2,6-diazaspiro[3.3]heptan-6-yl]-2-oxo-indoline-5-carbonitrile
Type:
Small organic molecule
Emp. Form.:
C33H38N6O5S
Mol. Mass.:
630.757
SMILES:
COc1ccc(nc1)S(=O)(=O)N1C2C=CC(=CC2C(N2CC3(CN(C3)C3CCN(C)CC3)C2)(C1=O)c1ccccc1OC)C#N
: