Target
Egl nine homolog 1
Ligand
BDBM306797
Substrate
Meas. Tech.
Inhibitory Effect of the Compounds on PHD2
IC50
91000±n/a nM
Citation
 Zhou, YCai, SWang, GJiao, LMin, PJing, YGuo, M Compound of 3-hydroxyl pyridine, preparation method thereof and pharmaceutical use thereof US Patent  US10149841 Publication Date 12/11/2018 
Target
Name:
Egl nine homolog 1
Synonyms:
C1orf12 EGLN1_HUMAN Hypoxia-inducible factor prolyl hydroxylase 2 (HIF-PH2) Prolyl hydroxylase domain-containing protein 2 (PHD2)
Type:
Protein
Mol. Mass.:
46035.59
Organism:
Homo sapiens (Human)
Description:
Q9GZT9
Residue:
426
  
Inhibitor
Name:
BDBM306797
Synonyms:
US10149841, Compound 8
Type:
Small organic molecule
Emp. Form.:
C18H14N2O5
Mol. Mass.:
338.3142
SMILES:
OC(=O)CNC(=O)c1ncc(Oc2ccc3ccccc3c2)cc1O
: