Target
Acetyl-CoA carboxylase 2
Ligand
BDBM306985
Substrate
Meas. Tech.
Inhibitory Activity on Human ACC1 and the ACC2
IC50
5.00±n/a nM
Citation
 Kobayashi, NAsahi, KTomida, YOhdan, MFumoto, MSasaki, YKurahashi, KInoue, TUrabe, TNishiura, YIwatsu, MMiyazaki, KOhyabu, NWada, TKatou, M Alkylene derivatives US Patent  US10150728 Publication Date 12/11/2018 
Target
Name:
Acetyl-CoA carboxylase 2
Synonyms:
ACACB ACC-beta ACCB Acetyl-CoA carboxylase 2 Acetyl-CoA carboxylase 2 (ACC2)
Type:
Protein
Mol. Mass.:
276535.21
Organism:
Homo sapiens (Human)
Description:
O00763
Residue:
2458
  
Inhibitor
Name:
BDBM306985
Synonyms:
US10150728, Example I-198
Type:
Small organic molecule
Emp. Form.:
C21H29N3O4S
Mol. Mass.:
419.538
SMILES:
C[C@@H](CO[C@H]1C[C@H](COc2ccc3nc(OCC4(C)CC4)sc3n2)C1)NC(C)=O
: