Target
Acetyl-CoA carboxylase 2
Ligand
BDBM307397
Substrate
Meas. Tech.
Inhibitory Activity on Human ACC1 and the ACC2
IC50
5.00±n/a nM
Citation
 Kobayashi, NAsahi, KTomida, YOhdan, MFumoto, MSasaki, YKurahashi, KInoue, TUrabe, TNishiura, YIwatsu, MMiyazaki, KOhyabu, NWada, TKatou, M Alkylene derivatives US Patent  US10150728 Publication Date 12/11/2018 
Target
Name:
Acetyl-CoA carboxylase 2
Synonyms:
ACACB ACC-beta ACCB Acetyl-CoA carboxylase 2 Acetyl-CoA carboxylase 2 (ACC2)
Type:
Protein
Mol. Mass.:
276535.21
Organism:
Homo sapiens (Human)
Description:
O00763
Residue:
2458
  
Inhibitor
Name:
BDBM307397
Synonyms:
US10150728, Example I-625
Type:
Small organic molecule
Emp. Form.:
C22H31FN4O4
Mol. Mass.:
434.5043
SMILES:
C[C@@H](CO[C@H]1CC[C@@H](CC1)Oc1nc2cnc(OCC3CC3)c(F)c2n1C)NC(C)=O
: