Target
Genome polyprotein
Ligand
BDBM307507
Substrate
Meas. Tech.
HBsAg Assay
IC50
740±n/a nM
Citation
 Cheng, ZHan, XWang, YYang, S 6,7-dihydropyrido[2,1-A]phthalazin-2-ones for the treatment and prophylaxis of hepatitis B virus infection US Patent  US10150740 Publication Date 12/11/2018 
Target
Name:
Genome polyprotein
Synonyms:
Genome polyprotein Hepatitis C virus polyprotein RNA-dependent RNA polymerase (NS5B)
Type:
Protein
Mol. Mass.:
327266.82
Organism:
Hepatitis C virus (HCV)
Description:
P26664
Residue:
3011
  
Inhibitor
Name:
BDBM307507
Synonyms:
US10150740, Example 3
Type:
Small organic molecule
Emp. Form.:
C18H18N2O5
Mol. Mass.:
342.3459
SMILES:
COc1cc2CN(CC=C)n3cc(C(O)=O)c(=O)cc3-c2cc1OC
: