Target
Toll-like receptor 7
Ligand
BDBM307524
Substrate
Meas. Tech.
Human TLR7 Assay
EC50
7300±n/a nM
Citation
 Hori, SHasegawa, FUrabe, DKurebayashi, H Carboxylic acid compounds US Patent  US10150743 Publication Date 12/11/2018 
Target
Name:
Toll-like receptor 7
Synonyms:
ORF Names:UNQ248/PRO285 TLR7_HUMAN | Toll-like receptor 7 (TLR7)
Type:
Enzyme
Mol. Mass.:
120945.35
Organism:
Homo sapiens (Human)
Description:
Q9NYK1
Residue:
1049
  
Inhibitor
Name:
BDBM307524
Synonyms:
(S)-3-((4-((2-amino-4-(1-hydroxyhexan-3-ylamino)-6-methylpyrimidin-5-yl)methyl)-3-methoxybenzyl)(ethyl)amino)propanoic acid US10562861, Ex. No. 5
Type:
Small organic molecule
Emp. Form.:
C25H39N5O4
Mol. Mass.:
473.6083
SMILES:
CCC[C@@H](CCO)Nc1nc(N)nc(C)c1Cc1ccc(CN(CC)CCC(O)=O)cc1OC
: