Target
Genome polyprotein
Ligand
BDBM307537
Substrate
Meas. Tech.
HCV Replicon Luciferase Assay
EC50
8.61±n/a nM
Citation
 Yeung, KKadow, JFBora, ROAnjanappa, PGupta, SV Compounds for the treatment of hepatitis C US Patent  US10150747 Publication Date 12/11/2018 
Target
Name:
Genome polyprotein
Synonyms:
Genome polyprotein RNA polymerase (NS5B)
Type:
Enzyme
Mol. Mass.:
326966.11
Organism:
Hepatitis C virus (HCV)
Description:
Q9WMX2
Residue:
3010
  
Inhibitor
Name:
BDBM307537
Synonyms:
5-(3-(Bicyclo[1.1.1]pentan-1-ylcarbamoyl)-4-fluorophenyl)-2-(4-fluoro phenyl)-N-methyl-6-(2,2,2-trifluoroethoxy)benzofuran-3-carboxamide | US10150747, Example 4
Type:
Small organic molecule
Emp. Form.:
C30H23F5N2O4
Mol. Mass.:
570.5066
SMILES:
CNC(=O)c1c(oc2cc(OCC(F)(F)F)c(cc12)-c1ccc(F)c(c1)C(=O)NC12CC(C1)C2)-c1ccc(F)cc1
: